Target
Broad substrate specificity ATP-binding cassette transporter ABCG2
Ligand
BDBM50030679
Substrate
Meas. Tech.
ChEMBL_1437089 (CHEMBL3381103)
EC50
3600±n/a nM
Citation
 Krauze, AGrinberga, SKrasnova, LAdlere, ISokolova, EDomracheva, IShestakova, IAndzans, ZDuburs, G Thieno[2,3-b]pyridines--a new class of multidrug resistance (MDR) modulators. Bioorg Med Chem 22:5860-70 (2014)  
Target
Name:
Broad substrate specificity ATP-binding cassette transporter ABCG2
Synonyms:
ABCG2 ABCP ATP-binding cassette sub-family G member 2 ATP-binding cassette, sub-family G, member 2 BCRP1 CDw338 Mitoxantrone resistance-associated protein Urate exporter
Type:
Multi-pass membrane protein; monomer or homodimer; disulfide-linked
Mol. Mass.:
72329.48
Organism:
Homo sapiens (Human)
Description:
Q9UNQ0
Residue:
655
  
Inhibitor
Name:
BDBM50030679
Synonyms:
CHEMBL3344543
Type:
Small organic molecule
Emp. Form.:
C26H24N2O6S
Mol. Mass.:
492.544
SMILES:
COC(=O)c1c(C)nc2sc(C(=O)c3ccc(OC)cc3)c(N)c2c1-c1ccc(OC)c(OC)c1
: