Target
Cathepsin S
Ligand
BDBM50030746
Substrate
Meas. Tech.
ChEMBL_1437723 (CHEMBL3382370)
Ki
0.176000±n/a nM
Citation
 Schmitz, JBeckmann, AMDudic, ALi, TSellier, RBartz, UGütschow, M 3-Cyano-3-aza-ß-amino Acid Derivatives as Inhibitors of Human Cysteine Cathepsins. ACS Med Chem Lett 5:1076-81 (2014)  
Target
Name:
Cathepsin S
Synonyms:
CATS_HUMAN Cathepsin S (Cat S) | cathepsin S preproprotein
Type:
Protein
Mol. Mass.:
37507.38
Organism:
Homo sapiens (Human)
Description:
P25774
Residue:
331
  
Inhibitor
Name:
BDBM50030746
Synonyms:
CHEMBL3342184 | acs.jmedchem.1c00409_ST.413
Type:
Small organic molecule
Emp. Form.:
C16H22N4O3
Mol. Mass.:
318.3709
SMILES:
CN(Cc1ccccc1)C(=O)CN(NC(=O)OC(C)(C)C)C#N
: