Target
Tubulin beta chain
Ligand
BDBM50030766
Substrate
Meas. Tech.
ChEMBL_1437751 (CHEMBL3383001)
IC50
1200±n/a nM
Citation
 Hayashi, YTakeno, HChinen, TMuguruma, KOkuyama, KTaguchi, ATakayama, KYakushiji, FMiura, MUsui, THayashi, Y Development of a new benzophenone-diketopiperazine-type potent antimicrotubule agent possessing a 2-pyridine structure. ACS Med Chem Lett 5:1094-8 (2014)  
Target
Name:
Tubulin beta chain
Synonyms:
Beta-tubulin Tubulin beta chain
Type:
PROTEIN
Mol. Mass.:
49840.26
Organism:
Sus scrofa
Description:
ChEMBL_105107
Residue:
445
  
Inhibitor
Name:
BDBM50030766
Synonyms:
CHEMBL3342339
Type:
Small organic molecule
Emp. Form.:
C24H17N3O3
Mol. Mass.:
395.4101
SMILES:
O=C(c1ccccc1)c1cccc(\C=c2/[nH]c(=O)\c(=C\c3ccccn3)[nH]c2=O)c1
: