Target
RCG37580
Ligand
BDBM50030790
Substrate
Meas. Tech.
ChEMBL_1438499 (CHEMBL3384903)
EC50
12±n/a nM
Citation
 Peukert, SHughes, RNunez, JHe, GYan, ZJain, RLlamas, LLuchansky, SCarlson, ALiang, GKunjathoor, VPietropaolo, MShapiro, JCastellana, AWu, XBose, A Discovery of 2-Pyridylpyrimidines as the First Orally Bioavailable GPR39 Agonists. ACS Med Chem Lett 5:1114-8 (2014)  
Target
Name:
RCG37580
Synonyms:
Ensembl:ENSRNOP00000036196 Gpr39 RCG37580
Type:
PROTEIN
Mol. Mass.:
33217.74
Organism:
Rattus norvegicus
Description:
ChEMBL_107978
Residue:
298
  
Inhibitor
Name:
BDBM50030790
Synonyms:
CHEMBL3342357
Type:
Small organic molecule
Emp. Form.:
C26H31FN6O2S
Mol. Mass.:
510.627
SMILES:
Fc1cccc(c1)S(=O)(=O)NC[C@H]1CC[C@H](CNc2nc(NC3CC3)cc(n2)-c2ccccn2)CC1
: