Target
G-protein coupled receptor 39
Ligand
BDBM50030790
Substrate
Meas. Tech.
ChEMBL_1438498 (CHEMBL3384902)
EC50
202±n/a nM
Citation
 Peukert, SHughes, RNunez, JHe, GYan, ZJain, RLlamas, LLuchansky, SCarlson, ALiang, GKunjathoor, VPietropaolo, MShapiro, JCastellana, AWu, XBose, A Discovery of 2-Pyridylpyrimidines as the First Orally Bioavailable GPR39 Agonists. ACS Med Chem Lett 5:1114-8 (2014)  
Target
Name:
G-protein coupled receptor 39
Synonyms:
GPR39 | GPR39_HUMAN
Type:
PROTEIN
Mol. Mass.:
51351.94
Organism:
Homo sapiens (Human)
Description:
ChEMBL_107977
Residue:
453
  
Inhibitor
Name:
BDBM50030790
Synonyms:
CHEMBL3342357
Type:
Small organic molecule
Emp. Form.:
C26H31FN6O2S
Mol. Mass.:
510.627
SMILES:
Fc1cccc(c1)S(=O)(=O)NC[C@H]1CC[C@H](CNc2nc(NC3CC3)cc(n2)-c2ccccn2)CC1
: