Target
RCG37580
Ligand
BDBM50030788
Substrate
Meas. Tech.
ChEMBL_1438505 (CHEMBL3385495)
EC50
0.400000±n/a nM
Citation
 Peukert, SHughes, RNunez, JHe, GYan, ZJain, RLlamas, LLuchansky, SCarlson, ALiang, GKunjathoor, VPietropaolo, MShapiro, JCastellana, AWu, XBose, A Discovery of 2-Pyridylpyrimidines as the First Orally Bioavailable GPR39 Agonists. ACS Med Chem Lett 5:1114-8 (2014)  
Target
Name:
RCG37580
Synonyms:
Ensembl:ENSRNOP00000036196 Gpr39 RCG37580
Type:
PROTEIN
Mol. Mass.:
33217.74
Organism:
Rattus norvegicus
Description:
ChEMBL_107978
Residue:
298
  
Inhibitor
Name:
BDBM50030788
Synonyms:
CHEMBL3342358
Type:
Small organic molecule
Emp. Form.:
C18H19ClN6O2S
Mol. Mass.:
418.9
SMILES:
CNc1nc(NCc2ccc(NS(C)(=O)=O)cc2Cl)cc(n1)-c1ccccn1
: