Target
Cathepsin S
Ligand
BDBM50030817
Substrate
Meas. Tech.
ChEMBL_1438542 (CHEMBL3385532)
IC50
2780±n/a nM
Citation
 Jadhav, PKSchiffler, MAGavardinas, KKim, EJMatthews, DPStaszak, MACoffey, DSShaw, BWCassidy, KCBrier, RAZhang, YChristie, RMMatter, WFQing, KDurbin, JDWang, YDeng, GG Discovery of Cathepsin S Inhibitor LY3000328 for the Treatment of Abdominal Aortic Aneurysm. ACS Med Chem Lett 5:1138-42 (2014)  
Target
Name:
Cathepsin S
Synonyms:
CATS_MOUSE Ctss
Type:
Enzyme
Mol. Mass.:
38476.67
Organism:
Mus musculus (Mouse)
Description:
O70370
Residue:
340
  
Inhibitor
Name:
BDBM50030817
Synonyms:
CHEMBL3342551
Type:
Small organic molecule
Emp. Form.:
C23H28N4O2
Mol. Mass.:
392.494
SMILES:
CN1CCN(CC1)C(=O)Nc1ccc2CCCC(NC(=O)c3ccccc3)c2c1
: