Target
Transthyretin
Ligand
BDBM50029196
Substrate
Meas. Tech.
ChEMBL_1441631 (CHEMBL3377077)
EC50
23000±n/a nM
Citation
 Yokoyama, TKosaka, YMizuguchi, M Inhibitory activities of propolis and its promising component, caffeic acid phenethyl ester, against amyloidogenesis of human transthyretin. J Med Chem 57:8928-35 (2014)  
Target
Name:
Transthyretin
Synonyms:
ATTR Prealbumin TTHY_HUMAN Transthyretin (TTR)
Type:
Enzyme
Mol. Mass.:
15884.31
Organism:
Homo sapiens (Human)
Description:
P02766
Residue:
147
  
Inhibitor
Name:
BDBM50029196
Synonyms:
(E)-3-(3,4-Dihydroxy-phenyl)-acrylic acid ethyl ester 3-(3,4-Dihydroxy-phenyl)-acrylic acid ethyl ester Ethyl 1-(3',4'-dihydroxyphenyl)propenate ethyl 3-(3,4-dihydroxyphenyl)acrylate
Type:
Small organic molecule
Emp. Form.:
C11H12O4
Mol. Mass.:
208.2106
SMILES:
CCOC(=O)\C=C\c1ccc(O)c(O)c1
: