Target
Bromodomain-containing protein 4
Ligand
BDBM50030898
Substrate
Meas. Tech.
ChEMBL_1442439 (CHEMBL3380069)
IC50
12900±n/a nM
Citation
 McKeown, MRShaw, DLFu, HLiu, SXu, XMarineau, JJHuang, YZhang, XBuckley, DLKadam, AZhang, ZBlacklow, SCQi, JZhang, WBradner, JE Biased multicomponent reactions to develop novel bromodomain inhibitors. J Med Chem 57:9019-27 (2014)  
Target
Name:
Bromodomain-containing protein 4
Synonyms:
BRD4 Bromodomain-containing protein 4 (BRD4) Protein HUNK1
Type:
Protein
Mol. Mass.:
152264.84
Organism:
Homo sapiens (Human)
Description:
O60885
Residue:
1362
  
Inhibitor
Name:
BDBM50030898
Synonyms:
CHEMBL3356567
Type:
Small organic molecule
Emp. Form.:
C20H22N6O
Mol. Mass.:
362.4283
SMILES:
Cc1noc(C)c1-c1ccc(nc1)-c1nc2cnccn2c1NC(C)(C)C
: