Target
Group 10 secretory phospholipase A2
Ligand
BDBM50031107
Substrate
Meas. Tech.
ChEMBL_1442449 (CHEMBL3380079)
IC50
316±n/a nM
Citation
 Chen, HKnerr, LÅkerud, THallberg, KÖster, LRohman, MÖsterlund, KBeisel, HGOlsson, TBrengdhal, JSandmark, JBodin, C Discovery of a novel pyrazole series of group X secreted phospholipase A2 inhibitor (sPLA2X) via fragment based virtual screening. Bioorg Med Chem Lett 24:5251-5 (2014)  
Target
Name:
Group 10 secretory phospholipase A2
Synonyms:
Group X secretory phospholipase A2 PLA2G10
Type:
PROTEIN
Mol. Mass.:
18153.11
Organism:
Homo sapiens (Human)
Description:
ChEMBL_1442449
Residue:
165
  
Inhibitor
Name:
BDBM50031107
Synonyms:
CHEMBL3337972
Type:
Small organic molecule
Emp. Form.:
C10H11N3OS
Mol. Mass.:
221.279
SMILES:
Cc1cc(c(C)s1)-c1cc(n[nH]1)C(N)=O
: