Target
Metabotropic glutamate receptor 4
Ligand
BDBM50031313
Substrate
Meas. Tech.
ChEMBL_1434271 (CHEMBL3385816)
IC50
11±n/a nM
Citation
 Kil, KEPoutiainen, PZhang, ZZhu, AChoi, JKJokivarsi, KBrownell, AL Radiosynthesis and evaluation of an 18F-labeled positron emission tomography (PET) radioligand for metabotropic glutamate receptor subtype 4 (mGlu4). J Med Chem 57:9130-8 (2014)  
Target
Name:
Metabotropic glutamate receptor 4
Synonyms:
GPRC1D GRM4_HUMAN MGLUR4 Metabotropic glutamate receptor 4 (mGlu4) metabotropic glutamate 4
Type:
Protein
Mol. Mass.:
101899.95
Organism:
Homo sapiens (Human)
Description:
Q14833
Residue:
912
  
Inhibitor
Name:
BDBM50031313
Synonyms:
CHEMBL3357575
Type:
Small organic molecule
Emp. Form.:
C21H14ClN3O3
Mol. Mass.:
391.807
SMILES:
Cc1cccc2C(=O)N(C(=O)c12)c1ccc(NC(=O)c2ccccn2)cc1Cl
: