Target
Protein arginine N-methyltransferase 1 [11-371]
Ligand
BDBM50031317
Substrate
Meas. Tech.
ChEMBL_1436397 (CHEMBL3389600)
IC50
37100±n/a nM
Citation
 Chen, SWang, YZhou, WLi, SPeng, JShi, ZHu, JLiu, YCDing, HLin, YLi, LCheng, SLiu, JLu, TJiang, HLiu, BZheng, MLuo, C Identifying novel selective non-nucleoside DNA methyltransferase 1 inhibitors through docking-based virtual screening. J Med Chem 57:9028-41 (2014)  
Target
Name:
Protein arginine N-methyltransferase 1 [11-371]
Synonyms:
ANM1_HUMAN HRMT1L2 PRMT1 Protein arginine methyltransferase 1 (PRMT1) | Protein-arginine N-methyltransferase 1
Type:
Protein
Mol. Mass.:
41506.52
Organism:
Homo sapiens (Human)
Description:
Q99873[11-371]
Residue:
361
  
Inhibitor
Name:
BDBM50031317
Synonyms:
CHEMBL3358015
Type:
Small organic molecule
Emp. Form.:
C25H25N3O
Mol. Mass.:
383.4855
SMILES:
OC(CNCCc1c[nH]c2ccccc12)Cn1c2ccccc2c2ccccc12
: