Target
Deoxycytidine kinase
Ligand
BDBM50031337
Substrate
Meas. Tech.
ChEMBL_1437136 (CHEMBL3381705)
Ki
9.2±n/a nM
Citation
 Nomme, JLi, ZGipson, RMWang, JArmijo, ALLe, TPoddar, SSmith, TSantarsiero, BDNguyen, HACzernin, JAlexandrova, ANJung, MERadu, CGLavie, A Structure-guided development of deoxycytidine kinase inhibitors with nanomolar affinity and improved metabolic stability. J Med Chem 57:9480-94 (2014)  
Target
Name:
Deoxycytidine kinase
Synonyms:
DCK | DCK_HUMAN
Type:
PROTEIN
Mol. Mass.:
30510.65
Organism:
Homo sapiens (Human)
Description:
ChEMBL_1437135
Residue:
260
  
Inhibitor
Name:
BDBM50031337
Synonyms:
CHEMBL3358097
Type:
Small organic molecule
Emp. Form.:
C20H26N6O4S3
Mol. Mass.:
510.653
SMILES:
COc1ccc(cc1OCCNS(C)(=O)=O)-c1nc([C@@H](C)Sc2nc(N)cc(N)n2)c(C)s1
: