Target
Adenosine receptor A2a
Ligand
BDBM50031505
Substrate
Meas. Tech.
ChEMBL_1438591 (CHEMBL3386696)
Ki
9700±n/a nM
Citation
 He, SHong, QLai, ZYang, DXTing, PCKuethe, JTCernak, TADykstra, KDSperbeck, DMWu, ZYu, YYang, GXJian, TLiu, JGuiadeen, DKrikorian, ADSonatore, LMWiltsie, JLiu, JGorski, JNChung, CCGibson, JTLisnock, JXiao, JWolff, MTong, SXMadeira, MKaranam, BVShen, DMBalkovec, JMPinto, SNargund, RPDeVita, RJ Discovery of a Potent and Selective DGAT1 Inhibitor with a Piperidinyl-oxy-cyclohexanecarboxylic Acid Moiety. ACS Med Chem Lett 5:1082-7 (2014)  
Target
Name:
Adenosine receptor A2a
Synonyms:
A2A adenosine receptor (hA2A) ADENOSINE A2 ADORA2 Adenosine A2A receptor (A2AAR)
Type:
G Protein-Coupled Receptor (GPCR)
Mol. Mass.:
44716.46
Organism:
Homo sapiens (Human)
Description:
P29274
Residue:
412
  
Inhibitor
Name:
BDBM50031505
Synonyms:
CHEMBL3342771
Type:
Small organic molecule
Emp. Form.:
C24H27FN4O3
Mol. Mass.:
438.4946
SMILES:
OC(=O)[C@H]1CC[C@@H](CC1)OC1CCN(CC1)c1ccc(cn1)-c1nc2cc(F)ccc2[nH]1
: