Target
Hypoxia-inducible factor 1-alpha
Ligand
BDBM50031521
Substrate
Meas. Tech.
ChEMBL_1440889 (CHEMBL3374592)
IC50
>30000±n/a nM
Citation
 Naik, RWon, MBan, HSBhattarai, DXu, XEo, YHong, YSSingh, SChoi, YAhn, HCLee, K Synthesis and structure-activity relationship study of chemical probes as hypoxia induced factor-1a/malate dehydrogenase 2 inhibitors. J Med Chem 57:9522-38 (2014)  
Target
Name:
Hypoxia-inducible factor 1-alpha
Synonyms:
BHLHE78 HIF-1-alpha, HIF-2-alpha HIF1A_HUMAN Hypoxia-inducible factor 1 alpha MOP1 von Hippel-Lindau disease tumor suppressor/Elongin-C/Elongin-B/HIF1A
Type:
Protein
Mol. Mass.:
92647.24
Organism:
Homo sapiens (Human)
Description:
Q16665
Residue:
826
  
Inhibitor
Name:
BDBM50031521
Synonyms:
CHEMBL3359148
Type:
Small organic molecule
Emp. Form.:
C20H14F3N3O5
Mol. Mass.:
433.3375
SMILES:
Oc1ccc(cc1NC(=O)COc1ccccc1C1(N=N1)C(F)(F)F)C(=O)OCC#C
: