Target
Malate dehydrogenase, mitochondrial
Ligand
BDBM50031520
Substrate
Meas. Tech.
ChEMBL_1440896 (CHEMBL3374599)
Ki
4300±n/a nM
Citation
 Naik, RWon, MBan, HSBhattarai, DXu, XEo, YHong, YSSingh, SChoi, YAhn, HCLee, K Synthesis and structure-activity relationship study of chemical probes as hypoxia induced factor-1a/malate dehydrogenase 2 inhibitors. J Med Chem 57:9522-38 (2014)  
Target
Name:
Malate dehydrogenase, mitochondrial
Synonyms:
MDH2 | MDHM_HUMAN
Type:
PROTEIN
Mol. Mass.:
35512.45
Organism:
Homo sapiens (Human)
Description:
ChEMBL_1456625
Residue:
338
  
Inhibitor
Name:
BDBM50031520
Synonyms:
CHEMBL3359147
Type:
Small organic molecule
Emp. Form.:
C30H28F3N3O5
Mol. Mass.:
567.5556
SMILES:
Oc1ccc(cc1NC(=O)COc1ccc(cc1C1(N=N1)C(F)(F)F)C12CC3CC(CC(C3)C1)C2)C(=O)OCC#C
: