Target
Carbonic anhydrase 1
Ligand
BDBM50429899
Substrate
Meas. Tech.
ChEMBL_1440922 (CHEMBL3375186)
Kd
0.110000±n/a nM
Target
Name:
Carbonic anhydrase 1
Synonyms:
CA-I CAB Carbonate dehydratase I Carbonic anhydrase 1 (CA I) Carbonic anhydrase 1 (Recombinant CA I) Carbonic anhydrase B Carbonic anhydrase I (CA I) Carbonic anhydrase I (CAI) Carbonic anhydrase isoenzyme I (hCA I) | hCA
Type:
Enzyme
Mol. Mass.:
28873.37
Organism:
Homo sapiens (Human)
Description:
P00915
Residue:
261
  
Inhibitor
Name:
BDBM50429899
Synonyms:
CHEMBL2333416
Type:
Small organic molecule
Emp. Form.:
C8H7F4NO3S2
Mol. Mass.:
305.27
SMILES:
NS(=O)(=O)c1c(F)c(F)c(SCCO)c(F)c1F
: