Target
Caspase-1
Ligand
BDBM50031609
Substrate
Meas. Tech.
ChEMBL_1441660 (CHEMBL3377637)
IC50
500000±n/a nM
Citation
 Limpachayaporn, PWagner, SKopka, KSchober, OSchäfers, MHaufe, G Synthesis of 7-halogenated isatin sulfonamides: nonradioactive counterparts of caspase-3/-7 inhibitor-based potential radiopharmaceuticals for molecular imaging of apoptosis. J Med Chem 57:9383-95 (2014)  
Target
Name:
Caspase-1
Synonyms:
CASP1 Caspase ICE IL1BCE Interleukin-1 beta-converting enzyme
Type:
Enzyme
Mol. Mass.:
45154.13
Organism:
Homo sapiens (Human)
Description:
P29466
Residue:
404
  
Inhibitor
Name:
BDBM50031609
Synonyms:
CHEMBL3359201
Type:
Small organic molecule
Emp. Form.:
C14H15FN2O5S
Mol. Mass.:
342.343
SMILES:
COC[C@@H]1CCCN1S(=O)(=O)c1cc2C(=O)C(=O)Nc2c(F)c1
: