Target
Caspase-7
Ligand
BDBM10320
Substrate
Meas. Tech.
ChEMBL_1441663 (CHEMBL3377640)
Ki
47±n/a nM
Citation
 Limpachayaporn, PWagner, SKopka, KSchober, OSchäfers, MHaufe, G Synthesis of 7-halogenated isatin sulfonamides: nonradioactive counterparts of caspase-3/-7 inhibitor-based potential radiopharmaceuticals for molecular imaging of apoptosis. J Med Chem 57:9383-95 (2014)  
Target
Name:
Caspase-7
Synonyms:
Apoptotic protease Mch-3 CASP7 CMH-1 MCH3 | caspase 7, apoptosis-related cysteine peptidase
Type:
Enzyme
Mol. Mass.:
34273.91
Organism:
Homo sapiens (Human)
Description:
P55210
Residue:
303
  
Inhibitor
Name:
BDBM10320
Synonyms:
(S)-1-Methyl-5-{1-[2-(phenoxymethyl)pyrrolidinyl]sulfonyl}isatin CHEMBL293034 Isatin Sulfonamide 31 | Pyrrolidine Isatin Analogue 11a
Type:
Small organic molecule
Emp. Form.:
C20H20N2O5S
Mol. Mass.:
400.448
SMILES:
CN1C(=O)C(=O)c2cc(ccc12)S(=O)(=O)N1CCC[C@H]1COc1ccccc1
: