Target
Polyamine deacetylase HDAC10
Ligand
BDBM50032266
Substrate
Meas. Tech.
ChEMBL_1440129 (CHEMBL3382542)
Ki
300±n/a nM
Citation
 Maolanon, ARVilladsen, JSChristensen, NJHoeck, CFriis, THarris, PGotfredsen, CHFristrup, POlsen, CA Methyl effect in azumamides provides insight into histone deacetylase inhibition by macrocycles. J Med Chem 57:9644-57 (2014)  
Target
Name:
Polyamine deacetylase HDAC10
Synonyms:
HD10 HDAC10 Histone deacetylase 10 | Human HDAC10
Type:
Chromatin regulator; hydrolase; repressor
Mol. Mass.:
71431.89
Organism:
Homo sapiens (Human)
Description:
Q969S8
Residue:
669
  
Inhibitor
Name:
BDBM50032266
Synonyms:
CHEMBL3352823
Type:
Small organic molecule
Emp. Form.:
C26H36N4O7
Mol. Mass.:
516.5866
SMILES:
CC(C)[C@H]1NC(=O)C[C@@H](C\C=C/CCC(O)=O)NC(=O)[C@@H](Cc2ccc(O)cc2)NC(=O)[C@@H](C)NC1=O
: