Target
Histone deacetylase 11
Ligand
BDBM50032268
Substrate
Meas. Tech.
ChEMBL_1440130 (CHEMBL3382543)
Ki
3200±n/a nM
Citation
 Maolanon, ARVilladsen, JSChristensen, NJHoeck, CFriis, THarris, PGotfredsen, CHFristrup, POlsen, CA Methyl effect in azumamides provides insight into histone deacetylase inhibition by macrocycles. J Med Chem 57:9644-57 (2014)  
Target
Name:
Histone deacetylase 11
Synonyms:
HD11 HDAC11 | Human HDAC11
Type:
Chromatin regulator; hydrolase; repressor
Mol. Mass.:
39187.66
Organism:
Homo sapiens (Human)
Description:
Q96DB2
Residue:
347
  
Inhibitor
Name:
BDBM50032268
Synonyms:
CHEMBL3352990
Type:
Small organic molecule
Emp. Form.:
C26H36N4O6
Mol. Mass.:
500.5872
SMILES:
CC(C)[C@H]1NC(=O)C[C@H](NC(=O)[C@@H](Cc2ccccc2)NC(=O)[C@@H](C)NC1=O)\C=C\CCCC(O)=O
: