Target
Mitogen-activated protein kinase 9
Ligand
BDBM50032745
Substrate
Meas. Tech.
ChEMBL_1442577 (CHEMBL3372270)
IC50
2836±n/a nM
Citation
 Zheng, KIqbal, SHernandez, PPark, HLoGrasso, PVFeng, Y Design and synthesis of highly potent and isoform selective JNK3 inhibitors: SAR studies on aminopyrazole derivatives. J Med Chem 57:10013-30 (2014)  
Target
Name:
Mitogen-activated protein kinase 9
Synonyms:
JNK-55 JNK2/JNK3 MK09_HUMAN Mitogen-activated protein kinase 8/9 SAPK1A c-Jun N-terminal kinase 2 | c-Jun N-terminal kinase 2 (JNK2)
Type:
Enzyme
Mol. Mass.:
48131.49
Organism:
Homo sapiens (Human)
Description:
JNK-2 was purchased from Upstate Cell Signaling Solutions (formerly Upstate Biotechnology).
Residue:
424
  
Inhibitor
Name:
BDBM50032745
Synonyms:
CHEMBL3355165
Type:
Small organic molecule
Emp. Form.:
C23H19ClN6O2
Mol. Mass.:
446.889
SMILES:
Cc1cc(NC(=O)c2cccc(c2)-n2cc(NC(=O)Nc3ccccc3Cl)cn2)ccn1
: