Target
Plasma kallikrein
Ligand
BDBM50032876
Substrate
Meas. Tech.
ChEMBL_1443466 (CHEMBL3377180)
Ki
8.0±n/a nM
Citation
 Hangeland, JJFriends, TJRossi, KASmallheer, JMWang, CSun, ZCorte, JRFang, TWong, PCRendina, ARBarbera, FABozarth, JMLuettgen, JMWatson, CAZhang, GWei, ARamamurthy, VMorin, PEBisacchi, GSSubramaniam, SArunachalam, PMathur, ASeiffert, DAWexler, RRQuan, ML Phenylimidazoles as potent and selective inhibitors of coagulation factor XIa with in vivo antithrombotic activity. J Med Chem 57:9915-32 (2014)  
Target
Name:
Plasma kallikrein
Synonyms:
Fletcher factor KLKB1 Kallikrein Plasma kallikrein heavy chain Plasma prekallikrein
Type:
Protein
Mol. Mass.:
71391.16
Organism:
Homo sapiens (Human)
Description:
P03952
Residue:
638
  
Inhibitor
Name:
BDBM50032876
Synonyms:
CHEMBL3355681
Type:
Small organic molecule
Emp. Form.:
C28H31F4N5O4
Mol. Mass.:
577.5705
SMILES:
OC(=O)C(F)(F)F.NC[C@H]1CC[C@@H](CC1)C(=O)N[C@@H](Cc1ccccc1)c1nc(c(F)[nH]1)-c1ccc(cc1)C(N)=O
: