Target
Neutrophil elastase
Ligand
BDBM50032889
Substrate
Meas. Tech.
ChEMBL_1431796 (CHEMBL3385092)
EC50
2.0±n/a nM
Citation
 Abdel-Magid, AF Neutrophil elastase inhibitors as potential anti-inflammatory therapies. ACS Med Chem Lett 5:1182-3 (2014)  
Target
Name:
Neutrophil elastase
Synonyms:
Bone marrow serine protease Coagulation factor X ELANE Elastase HLE Leukocyte elastase Medullasin Neutrophil elastase (HNE) PMN elastase Trypsin
Type:
Enzyme
Mol. Mass.:
28532.38
Organism:
Homo sapiens (Human)
Description:
P08246
Residue:
267
  
Inhibitor
Name:
BDBM50032889
Synonyms:
CHEMBL3342779 US9670166, 24
Type:
Small organic molecule
Emp. Form.:
C24H20F3N3O4S
Mol. Mass.:
503.494
SMILES:
CCN1C(C2=C(CCC2=O)N(C1=O)c1cccc(c1)C(F)(F)F)c1ccc(cc1S(C)(=O)=O)C#N
: