Target
Isocitrate dehydrogenase [NADP] cytoplasmic
Ligand
BDBM50032891
Substrate
Meas. Tech.
ChEMBL_1431797 (CHEMBL3385093)
IC50
376±n/a nM
Citation
 Abdel-Magid, AF Inhibitors of Mutant IDH for the Treatment of Cancer. ACS Med Chem Lett 5:1184-5 (2014)  
Target
Name:
Isocitrate dehydrogenase [NADP] cytoplasmic
Synonyms:
Cytosolic NADP-isocitrate dehydrogenase IDH1 IDP Isocitrate dehydrogenase 1 (IDH1) Oxalosuccinate decarboxylase | PICD
Type:
Protein
Mol. Mass.:
46661.29
Organism:
Homo sapiens (Human)
Description:
O75874
Residue:
414
  
Inhibitor
Name:
BDBM50032891
Synonyms:
CHEMBL3342784
Type:
Small organic molecule
Emp. Form.:
C25H33FN6O2
Mol. Mass.:
468.5669
SMILES:
C[C@H](Nc1nccc(n1)N1C(=O)OC[C@]1(C)C1CC1)c1ccc(CN2CCC(N)CC2)c(F)c1
: