Target
Peregrin
Ligand
BDBM50032927
Substrate
Meas. Tech.
ChEMBL_1431805 (CHEMBL3385101)
IC50
50±n/a nM
Citation
 Demont, EHBamborough, PChung, CWCraggs, PDFallon, DGordon, LJGrandi, PHobbs, CIHussain, JJones, EJLe Gall, AMichon, AMMitchell, DJPrinjha, RKRoberts, ADSheppard, RJWatson, RJ 1,3-Dimethyl Benzimidazolones Are Potent, Selective Inhibitors of the BRPF1 Bromodomain. ACS Med Chem Lett 5:1190-5 (2014)  
Target
Name:
Peregrin
Synonyms:
BR140 BRPF1_HUMAN Peregrin | Protein Br140
Type:
PROTEIN
Mol. Mass.:
137524.47
Organism:
Homo sapiens (Human)
Description:
ChEMBL_108054
Residue:
1214
  
Inhibitor
Name:
BDBM50032927
Synonyms:
CHEMBL3356143 PFI 4 PFI4
Type:
Small organic molecule
Emp. Form.:
C21H24N4O3
Mol. Mass.:
380.4403
SMILES:
COc1ccccc1C(=O)Nc1cc2n(C)c(=O)n(C)c2cc1N1CCCC1
: