Target
Peregrin
Ligand
BDBM50032923
Substrate
Meas. Tech.
ChEMBL_1431805 (CHEMBL3385101)
IC50
794±n/a nM
Citation
 Demont, EHBamborough, PChung, CWCraggs, PDFallon, DGordon, LJGrandi, PHobbs, CIHussain, JJones, EJLe Gall, AMichon, AMMitchell, DJPrinjha, RKRoberts, ADSheppard, RJWatson, RJ 1,3-Dimethyl Benzimidazolones Are Potent, Selective Inhibitors of the BRPF1 Bromodomain. ACS Med Chem Lett 5:1190-5 (2014)  
Target
Name:
Peregrin
Synonyms:
BR140 BRPF1_HUMAN Peregrin | Protein Br140
Type:
PROTEIN
Mol. Mass.:
137524.47
Organism:
Homo sapiens (Human)
Description:
ChEMBL_108054
Residue:
1214
  
Inhibitor
Name:
BDBM50032923
Synonyms:
CHEMBL3356144
Type:
Small organic molecule
Emp. Form.:
C21H24N4O2
Mol. Mass.:
364.4409
SMILES:
Cn1c2cc(NC(=O)Cc3ccccc3)c(cc2n(C)c1=O)N1CCCC1
: