Target
Serine protease hepsin
Ligand
BDBM50032943
Substrate
Meas. Tech.
ChEMBL_1432692 (CHEMBL3389936)
Ki
1.4±n/a nM
Citation
 Han, ZHarris, PKJones, DEChugani, RKim, TAgarwal, MShen, WWildman, SAJanetka, JW Inhibitors of HGFA, Matriptase, and Hepsin Serine Proteases: A Nonkinase Strategy to Block Cell Signaling in Cancer. ACS Med Chem Lett 5:1219-24 (2014)  
Target
Name:
Serine protease hepsin
Synonyms:
HEPS_HUMAN Hepsin TMPRSS1 Transmembrane protease, serine 1
Type:
Enzyme
Mol. Mass.:
45016.98
Organism:
Homo sapiens (Human)
Description:
Human deglycosylated hepsin was expressed in Pichia pastoris.
Residue:
417
  
Inhibitor
Name:
BDBM50032943
Synonyms:
CHEMBL3356602
Type:
Small organic molecule
Emp. Form.:
C27H46N10O6S
Mol. Mass.:
638.783
SMILES:
CC(C)C[C@H](NC(=O)[C@H](CCCCN)NC(=O)[C@H](CC(N)=O)NC(C)=O)C(=O)N[C@@H](CCCNC(N)=N)C(=O)c1nccs1
: