Target
Hepatocyte growth factor activator
Ligand
BDBM50032947
Substrate
Meas. Tech.
ChEMBL_1432690 (CHEMBL3389934)
Ki
17±n/a nM
Citation
 Han, ZHarris, PKJones, DEChugani, RKim, TAgarwal, MShen, WWildman, SAJanetka, JW Inhibitors of HGFA, Matriptase, and Hepsin Serine Proteases: A Nonkinase Strategy to Block Cell Signaling in Cancer. ACS Med Chem Lett 5:1219-24 (2014)  
Target
Name:
Hepatocyte growth factor activator
Synonyms:
HGF activator HGFAC Hepatocyte growth factor activator Hepatocyte growth factor activator short chain
Type:
PROTEIN
Mol. Mass.:
70690.18
Organism:
Homo sapiens (Human)
Description:
ChEMBL_109514
Residue:
655
  
Inhibitor
Name:
BDBM50032947
Synonyms:
CHEMBL3356606
Type:
Small organic molecule
Emp. Form.:
C29H52N12O5S
Mol. Mass.:
680.866
SMILES:
CC(C)C[C@H](NC(=O)[C@H](CCCCN)NC(=O)[C@H](CCCNC(N)=N)NC(C)=O)C(=O)N[C@@H](CCCNC(N)=N)C(=O)c1nccs1
: