Target
Cysteinyl leukotriene receptor 1
Ligand
BDBM50033087
Substrate
Meas. Tech.
ChEMBL_1432710 (CHEMBL3389954)
IC50
130±n/a nM
Citation
 Itadani, STakahashi, SIma, MSekiguchi, TFujita, MNakayama, YTakeuchi, J Discovery of Highly Potent Dual CysLT1 and CysLT2 Antagonist. ACS Med Chem Lett 5:1230-4 (2014)  
Target
Name:
Cysteinyl leukotriene receptor 1
Synonyms:
CLTR1_HUMAN CYSLTR1 Cysteinyl leukotriene receptor HG55 LTD4 receptor | Leukotriene Cysteinyl 1
Type:
Enzyme Catalytic Domain
Mol. Mass.:
38565.16
Organism:
Homo sapiens (Human)
Description:
Leukotriene Cysteinyl 1 CYSLTR1 HUMAN::Q9Y271
Residue:
337
  
Inhibitor
Name:
BDBM50033087
Synonyms:
CHEMBL3342957
Type:
Small organic molecule
Emp. Form.:
C32H36N2O7
Mol. Mass.:
560.6374
SMILES:
OC(=O)CCCCCN1CC(Oc2c(NC(=O)c3ccc(OCCCCc4ccccc4)cc3)cccc12)C(O)=O
: