Target
Cathepsin B
Ligand
BDBM50033403
Substrate
Meas. Tech.
ChEMBL_1434318 (CHEMBL3386422)
IC50
33000±n/a nM
Citation
 Thomas, AAHunt, KWNewhouse, BWatts, RJLiu, XVigers, GSmith, DRhodes, SPBrown, KDOtten, JNBurkard, MCox, AAGeck Do, MKDutcher, DRana, SDeLisle, RKRegal, KWright, ADGroneberg, RLiao, JScearce-Levie, KSiu, MPurkey, HELyssikatos, JP 8-Tetrahydropyran-2-yl chromans: highly selective beta-site amyloid precursor protein cleaving enzyme 1 (BACE1) inhibitors. J Med Chem 57:10112-29 (2014)  
Target
Name:
Cathepsin B
Synonyms:
APP secretase CATB_HUMAN CTSB Cathepsin B light chain | Cathepsin B1
Type:
Enzyme
Mol. Mass.:
37819.69
Organism:
Homo sapiens (Human)
Description:
gi_63102437
Residue:
339
  
Inhibitor
Name:
BDBM50033403
Synonyms:
CHEMBL3357661
Type:
Small organic molecule
Emp. Form.:
C20H20FN3O3
Mol. Mass.:
369.3895
SMILES:
[H][C@]12OCCC[C@]1(C)Oc1ccc(cc1[C@@]21COC(N)=N1)-c1cccnc1F
: