Target
Glycylpeptide N-tetradecanoyltransferase 1
Ligand
BDBM50033617
Substrate
Meas. Tech.
ChEMBL_1435039 (CHEMBL3387685)
IC50
5.0±n/a nM
Citation
 Brand, SNorcross, NRThompson, SHarrison, JRSmith, VCRobinson, DATorrie, LSMcElroy, SPHallyburton, INorval, SScullion, PStojanovski, LSimeons, FRvan Aalten, DFrearson, JABrenk, RFairlamb, AHFerguson, MAWyatt, PGGilbert, IHRead, KD Lead optimization of a pyrazole sulfonamide series of Trypanosoma brucei N-myristoyltransferase inhibitors: identification and evaluation of CNS penetrant compounds as potential treatments for stage 2 human African trypanosomiasis. J Med Chem 57:9855-69 (2014)  
Target
Name:
Glycylpeptide N-tetradecanoyltransferase 1
Synonyms:
Myristoyl-CoA:protein N-myristoyltransferase (Nmt) NMT NMT1_HUMAN Peptide N-myristoyltransferase 1
Type:
Enzyme
Mol. Mass.:
56814.10
Organism:
Homo sapiens (Human)
Description:
P30419
Residue:
496
  
Inhibitor
Name:
BDBM50033617
Synonyms:
CHEMBL3358120
Type:
Small organic molecule
Emp. Form.:
C23H32Cl2F2N4O2S
Mol. Mass.:
537.494
SMILES:
CN1CCC(CCCCc2cc(Cl)c(c(Cl)c2)S(=O)(=O)N(C(F)F)c2c(C)nn(C)c2C)CC1
: