Target
72 kDa type IV collagenase
Ligand
BDBM50033809
Substrate
Meas. Tech.
ChEMBL_1435761 (CHEMBL3388953)
IC50
24000±n/a nM
Citation
 Durham, TBKlimkowski, VJRito, CJMarimuthu, JToth, JLLiu, CDurbin, JDStout, SLAdams, LSwearingen, CLin, CChambers, MGThirunavukkarasu, KWiley, MR Identification of potent and selective hydantoin inhibitors of aggrecanase-1 and aggrecanase-2 that are efficacious in both chemical and surgical models of osteoarthritis. J Med Chem 57:10476-85 (2014)  
Target
Name:
72 kDa type IV collagenase
Synonyms:
72 kDa gelatinase CLG4A Gelatinase A (MMP-2) MMP2_HUMAN Matrix metalloproteinase-2 (MMP 2) Matrix metalloproteinases 2 (MMP-2) | TBE-1
Type:
Enzyme
Mol. Mass.:
73870.36
Organism:
Homo sapiens (Human)
Description:
P08253
Residue:
660
  
Inhibitor
Name:
BDBM50033809
Synonyms:
CHEMBL3358151
Type:
Small organic molecule
Emp. Form.:
C13H14ClN3O4
Mol. Mass.:
311.721
SMILES:
C[C@]1(CNC(=O)COc2ccc(Cl)cc2)NC(=O)NC1=O
: