Target
Acetyl-CoA carboxylase 2
Ligand
BDBM50034371
Substrate
Meas. Tech.
ChEMBL_1438678 (CHEMBL3387922)
IC50
33±n/a nM
Citation
 Griffith, DAKung, DWEsler, WPAmor, PABagley, SWBeysen, CCarvajal-Gonzalez, SDoran, SDLimberakis, CMathiowetz, AMMcPherson, KPrice, DARavussin, ESonnenberg, GESouthers, JASweet, LJTurner, SMVajdos, FF Decreasing the rate of metabolic ketone reduction in the discovery of a clinical acetyl-CoA carboxylase inhibitor for the treatment of diabetes. J Med Chem 57:10512-26 (2014)  
Target
Name:
Acetyl-CoA carboxylase 2
Synonyms:
ACACB ACC-beta ACCB Acetyl-CoA carboxylase 2 Acetyl-CoA carboxylase 2 (ACC2)
Type:
Protein
Mol. Mass.:
276535.21
Organism:
Homo sapiens (Human)
Description:
O00763
Residue:
2458
  
Inhibitor
Name:
BDBM50034371
Synonyms:
CHEMBL3359265
Type:
Small organic molecule
Emp. Form.:
C23H27N5O2
Mol. Mass.:
405.4928
SMILES:
CC(C)n1ncc2CC3(CCN(CC3)C(=O)c3ccc4nc(C)[nH]c4c3)CC(=O)c12
: