Target
High affinity cAMP-specific 3',5'-cyclic phosphodiesterase 7A
Ligand
BDBM50034641
Substrate
Meas. Tech.
ChEMBL_1440220 (CHEMBL3383765)
IC50
1800±n/a nM
Citation
 Shao, YXHuang, MCui, WFeng, LJWu, YCai, YLi, ZZhu, XLiu, PWan, YKe, HLuo, HB Discovery of a phosphodiesterase 9A inhibitor as a potential hypoglycemic agent. J Med Chem 57:10304-13 (2014)  
Target
Name:
High affinity cAMP-specific 3',5'-cyclic phosphodiesterase 7A
Synonyms:
3',5'-cyclic phosphodiesterase PDE7A_HUMAN Phosphodiesterase 7 (PDE7) Phosphodiesterase 7A (PDE7A1)
Type:
Enzyme
Mol. Mass.:
55514.96
Organism:
Homo sapiens (Human)
Description:
Q13946
Residue:
482
  
Inhibitor
Name:
BDBM50034641
Synonyms:
CHEMBL3360415
Type:
Small organic molecule
Emp. Form.:
C20H24N6O3
Mol. Mass.:
396.443
SMILES:
COc1ccc(NC(=O)[C@@H](C)Nc2nc3n(ncc3c(=O)[nH]2)C2CCCC2)cc1
: