Target
Myeloperoxidase
Ligand
BDBM50035231
Substrate
Meas. Tech.
ChEMBL_1432743 (CHEMBL3390547)
IC50
660±n/a nM
Citation
 Roth, AOtt, SFarber, KMPalazzo, TAConrad, WEHaddadin, MJTantillo, DJCross, CEEiserich, JPKurth, MJ Inhibition of myeloperoxidase: evaluation of 2H-indazoles and 1H-indazolones. Bioorg Med Chem 22:6422-9 (2014)  
Target
Name:
Myeloperoxidase
Synonyms:
84 kDa myeloperoxidase MPO Myeloperoxidase Myeloperoxidase heavy chain PERM_HUMAN
Type:
Enzyme
Mol. Mass.:
83888.32
Organism:
Homo sapiens (Human)
Description:
P05164
Residue:
745
  
Inhibitor
Name:
BDBM50035231
Synonyms:
CHEMBL3145355
Type:
Small organic molecule
Emp. Form.:
C10H12N2O
Mol. Mass.:
176.2151
SMILES:
CC(C)n1[nH]c2ccccc2c1=O
: