Target
Matrix metalloproteinase-17
Ligand
BDBM50035507
Substrate
Meas. Tech.
ChEMBL_1441830 (CHEMBL3380041)
IC50
5.7±n/a nM
Citation
 Matusiak, NCastelli, RTuin, AWOverkleeft, HSWisastra, RDekker, FJPrély, LMBischoff, RBischoff, RPvan Waarde, ADierckx, RAElsinga, PH A dual inhibitor of matrix metalloproteinases and a disintegrin and metalloproteinases, [¹8F]FB-ML5, as a molecular probe for non-invasive MMP/ADAM-targeted imaging. Bioorg Med Chem 23:192-202 (2014)  
Target
Name:
Matrix metalloproteinase-17
Synonyms:
MMP-17 MMP17_HUMAN MT4-MMP MTMMP4 Matrix metalloproteinase-17 Membrane-type-4 matrix metalloproteinase
Type:
PROTEIN
Mol. Mass.:
66652.56
Organism:
Homo sapiens (Human)
Description:
ChEMBL_1433225
Residue:
603
  
Inhibitor
Name:
BDBM50035507
Synonyms:
CHEMBL3355722
Type:
Small organic molecule
Emp. Form.:
C23H37N5O5
Mol. Mass.:
463.5704
SMILES:
CC(C)C[C@H](CC(=O)NO)C(=O)N[C@@H](Cc1ccccc1)C(=O)N[C@@H](CCCCN)C(N)=O
: