Target
Cystic fibrosis transmembrane conductance regulator
Ligand
BDBM50035579
Substrate
Meas. Tech.
ChEMBL_1433633 (CHEMBL3385212)
EC50
42±n/a nM
Citation
 Hadida, SVan Goor, FZhou, JArumugam, VMcCartney, JHazlewood, ADecker, CNegulescu, PGrootenhuis, PD Discovery of N-(2,4-di-tert-butyl-5-hydroxyphenyl)-4-oxo-1,4-dihydroquinoline-3-carboxamide (VX-770, ivacaftor), a potent and orally bioavailable CFTR potentiator. J Med Chem 57:9776-95 (2014)  
Target
Name:
Cystic fibrosis transmembrane conductance regulator
Synonyms:
ABCC7 CFTR Channel conductance-controlling ATPase | cAMP-dependent chloride channel
Type:
Enzyme Catalytic Domain
Mol. Mass.:
168171.30
Organism:
Homo sapiens (Human)
Description:
gi_90421313
Residue:
1480
  
Inhibitor
Name:
BDBM50035579
Synonyms:
CHEMBL3356646
Type:
Small organic molecule
Emp. Form.:
C22H21N3O2
Mol. Mass.:
359.421
SMILES:
CC(C)(C)c1c[nH]c2cc(NC(=O)c3c[nH]c4ccccc4c3=O)ccc12
: