Target
Cystic fibrosis transmembrane conductance regulator
Ligand
BDBM50035595
Substrate
Meas. Tech.
ChEMBL_1432831 (CHEMBL3382095)
EC50
20±n/a nM
Citation
 Hadida, SVan Goor, FZhou, JArumugam, VMcCartney, JHazlewood, ADecker, CNegulescu, PGrootenhuis, PD Discovery of N-(2,4-di-tert-butyl-5-hydroxyphenyl)-4-oxo-1,4-dihydroquinoline-3-carboxamide (VX-770, ivacaftor), a potent and orally bioavailable CFTR potentiator. J Med Chem 57:9776-95 (2014)  
Target
Name:
Cystic fibrosis transmembrane conductance regulator
Synonyms:
ABCC7 CFTR Channel conductance-controlling ATPase | cAMP-dependent chloride channel
Type:
Enzyme Catalytic Domain
Mol. Mass.:
168171.30
Organism:
Homo sapiens (Human)
Description:
gi_90421313
Residue:
1480
  
Inhibitor
Name:
BDBM50035595
Synonyms:
CHEMBL3357125
Type:
Small organic molecule
Emp. Form.:
C20H17N3O2
Mol. Mass.:
331.3679
SMILES:
CCc1cc2cc[nH]c2cc1NC(=O)c1c[nH]c2ccccc2c1=O
: