Target
Serine/threonine-protein kinase PknB
Ligand
BDBM50035657
Substrate
Meas. Tech.
ChEMBL_1434383 (CHEMBL3387070)
Ki
7320±n/a nM
Citation
 Naqvi, AMalasoni, RSrivastava, APandey, RRDwivedi, AK Design, synthesis and molecular docking of substituted 3-hydrazinyl-3-oxo-propanamides as anti-tubercular agents. Bioorg Med Chem Lett 24:5181-4 (2014)  
Target
Name:
Serine/threonine-protein kinase PknB
Synonyms:
PKNB_MYCTU | pknB
Type:
PROTEIN
Mol. Mass.:
66497.93
Organism:
Mycobacterium tuberculosis
Description:
ChEMBL_774233
Residue:
626
  
Inhibitor
Name:
BDBM50035657
Synonyms:
CHEMBL3338469
Type:
Small organic molecule
Emp. Form.:
C10H11N3O4
Mol. Mass.:
237.212
SMILES:
NNC(=O)CC(=O)Nc1ccccc1C(O)=O
: