Target
Carbonic anhydrase 1
Ligand
BDBM50035676
Substrate
Meas. Tech.
ChEMBL_1434385 (CHEMBL3387072)
Ki
403±n/a nM
Citation
 Abdel-Aziz, AAEl-Azab, ASCeruso, MSupuran, CT Carbonic anhydrase inhibitory activity of sulfonamides and carboxylic acids incorporating cyclic imide scaffolds. Bioorg Med Chem Lett 24:5185-9 (2014)  
Target
Name:
Carbonic anhydrase 1
Synonyms:
CA-I CAB Carbonate dehydratase I Carbonic anhydrase 1 (CA I) Carbonic anhydrase 1 (Recombinant CA I) Carbonic anhydrase B Carbonic anhydrase I (CA I) Carbonic anhydrase I (CAI) Carbonic anhydrase isoenzyme I (hCA I) | hCA
Type:
Enzyme
Mol. Mass.:
28873.37
Organism:
Homo sapiens (Human)
Description:
P00915
Residue:
261
  
Inhibitor
Name:
BDBM50035676
Synonyms:
CHEMBL2377772
Type:
Small organic molecule
Emp. Form.:
C15H11N3O6S
Mol. Mass.:
361.329
SMILES:
NS(=O)(=O)c1ccc(CN2C(=O)c3ccc(cc3C2=O)[N+]([O-])=O)cc1
: