Target
Carbonic anhydrase 2
Ligand
BDBM152638
Substrate
Meas. Tech.
ChEMBL_1434386 (CHEMBL3387073)
Ki
2.2±n/a nM
Citation
 Abdel-Aziz, AAEl-Azab, ASCeruso, MSupuran, CT Carbonic anhydrase inhibitory activity of sulfonamides and carboxylic acids incorporating cyclic imide scaffolds. Bioorg Med Chem Lett 24:5185-9 (2014)  
Target
Name:
Carbonic anhydrase 2
Synonyms:
CA-II CAC Carbonate dehydratase II Carbonic anhydrase 2 (CA-II) Carbonic anhydrase C Carbonic anhydrase II (CA-II) Carbonic anhydrase II (hCA II) | Carbonic anhydrase isoenzyme II (hCA II)
Type:
Enzyme
Mol. Mass.:
29250.71
Organism:
Homo sapiens (Human)
Description:
P00918
Residue:
260
  
Inhibitor
Name:
BDBM152638
Synonyms:
4-(1,3-Dioxoisoindolin-2-yl)benzenesulphonamide (1) | BDBM50222606
Type:
Small organic molecule
Emp. Form.:
C14H10N2O4S
Mol. Mass.:
302.305
SMILES:
NS(=O)(=O)c1ccc(cc1)N1C(=O)c2ccccc2C1=O
: