Target
Carbonic anhydrase 2
Ligand
BDBM50035692
Substrate
Meas. Tech.
ChEMBL_1434386 (CHEMBL3387073)
Ki
5.6±n/a nM
Citation
 Abdel-Aziz, AAEl-Azab, ASCeruso, MSupuran, CT Carbonic anhydrase inhibitory activity of sulfonamides and carboxylic acids incorporating cyclic imide scaffolds. Bioorg Med Chem Lett 24:5185-9 (2014)  
Target
Name:
Carbonic anhydrase 2
Synonyms:
CA-II CAC Carbonate dehydratase II Carbonic anhydrase 2 (CA-II) Carbonic anhydrase C Carbonic anhydrase II (CA-II) Carbonic anhydrase II (hCA II) | Carbonic anhydrase isoenzyme II (hCA II)
Type:
Enzyme
Mol. Mass.:
29250.71
Organism:
Homo sapiens (Human)
Description:
P00918
Residue:
260
  
Inhibitor
Name:
BDBM50035692
Synonyms:
CHEMBL2377791
Type:
Small organic molecule
Emp. Form.:
C18H18N2O4S
Mol. Mass.:
358.412
SMILES:
CC(C)(C)c1ccc2C(=O)N(C(=O)c2c1)c1ccc(cc1)S(N)(=O)=O
: