Target
Carbonic anhydrase 12
Ligand
BDBM50035695
Substrate
Meas. Tech.
ChEMBL_1434388 (CHEMBL3387075)
Ki
1.000000±n/a nM
Citation
 Abdel-Aziz, AAEl-Azab, ASCeruso, MSupuran, CT Carbonic anhydrase inhibitory activity of sulfonamides and carboxylic acids incorporating cyclic imide scaffolds. Bioorg Med Chem Lett 24:5185-9 (2014)  
Target
Name:
Carbonic anhydrase 12
Synonyms:
CA-XII CAH12_HUMAN Carbonic anhydrase Carbonic anhydrase XII Carbonic anhydrase XII (CAXII) | Tumor antigen HOM-RCC-3.1.3
Type:
Enzyme
Mol. Mass.:
39456.00
Organism:
Homo sapiens (Human)
Description:
Catalytic domain of human cloned isozyme was used in the assay
Residue:
354
  
Inhibitor
Name:
BDBM50035695
Synonyms:
CHEMBL2377777
Type:
Small organic molecule
Emp. Form.:
C13H7N3O4
Mol. Mass.:
269.2124
SMILES:
OC(=O)c1ccc(cc1)N1C(=O)c2nccnc2C1=O
: