Target
Carbonic anhydrase 9
Ligand
BDBM50035672
Substrate
Meas. Tech.
ChEMBL_1434387 (CHEMBL3387074)
Ki
42±n/a nM
Citation
 Abdel-Aziz, AAEl-Azab, ASCeruso, MSupuran, CT Carbonic anhydrase inhibitory activity of sulfonamides and carboxylic acids incorporating cyclic imide scaffolds. Bioorg Med Chem Lett 24:5185-9 (2014)  
Target
Name:
Carbonic anhydrase 9
Synonyms:
CA-IX CAH9_HUMAN Carbonic anhydrase 9 (CA IX) Carbonic anhydrase 9 precursor Carbonic anhydrase IX (CAIX) Carbonic anhydrases; II & IX MN RCC-associated antigen G250
Type:
Enzyme
Mol. Mass.:
49669.03
Organism:
Homo sapiens (Human)
Description:
Catalytic domain of human cloned isozyme was used in the assay
Residue:
459
  
Inhibitor
Name:
BDBM50035672
Synonyms:
CHEMBL2377795
Type:
Small organic molecule
Emp. Form.:
C15H7Cl2NO4
Mol. Mass.:
336.126
SMILES:
OC(=O)c1ccc(cc1)N1C(=O)c2cc(Cl)c(Cl)cc2C1=O
: