Target
Prostaglandin G/H synthase 1
Ligand
BDBM50035942
Substrate
Meas. Tech.
ChEMBL_1436536 (CHEMBL3382315)
IC50
64500±n/a nM
Citation
 Alegaon, SGHirpara, MBAlagawadi, KRHullatti, KKKashniyal, K Synthesis of novel pyrazole?thiadiazole hybrid as potential potent and selective cyclooxygenase-2 (COX-2) inhibitors. Bioorg Med Chem Lett 24:5324-9 (2015)  
Target
Name:
Prostaglandin G/H synthase 1
Synonyms:
COX1 Cyclooxygenase-1 (COX-1) PTGS1 | Prostaglandin G/H synthase (cyclooxygenase)
Type:
Protein
Mol. Mass.:
68868.60
Organism:
Ovis aries (Sheep)
Description:
Residue:
600
  
Inhibitor
Name:
BDBM50035942
Synonyms:
CHEMBL3338720
Type:
Small organic molecule
Emp. Form.:
C23H18ClN5S
Mol. Mass.:
431.941
SMILES:
Clc1ccc(cc1)-c1nn(cc1\C=N/NC(=S)Nc1ccccc1)-c1ccccc1
: