Target
Non-receptor tyrosine-protein kinase TYK2
Ligand
BDBM50035841
Substrate
Meas. Tech.
ChEMBL_1441073 (CHEMBL3377595)
IC50
16±n/a nM
Citation
 Duan, JJLu, ZJiang, BYang, BVDoweyko, LMNirschl, DSHaque, LELin, SBrown, GHynes, JTokarski, JSSack, JSKhan, JLippy, JSZhang, RFPitt, SShen, GPitts, WJCarter, PHBarrish, JCNadler, SGSalter-Cid, LMMcKinnon, MFura, ASchieven, GLWrobleski, ST Discovery of pyrrolo[1,2-b]pyridazine-3-carboxamides as Janus kinase (JAK) inhibitors. Bioorg Med Chem Lett 24:5721-6 (2014)  
Target
Name:
Non-receptor tyrosine-protein kinase TYK2
Synonyms:
Non-receptor tyrosine-protein kinase TYK2 (TYK2) TYK2_HUMAN | Tyrosine-protein kinase TYK2
Type:
Protein
Mol. Mass.:
133666.03
Organism:
Homo sapiens (Human)
Description:
P29597
Residue:
1187
  
Inhibitor
Name:
BDBM50035841
Synonyms:
CHEMBL3359907
Type:
Small organic molecule
Emp. Form.:
C14H20N4O
Mol. Mass.:
260.3348
SMILES:
C[C@@H](Nc1c(cnn2cccc12)C(N)=O)C(C)(C)C
: