Target
Acetylcholinesterase
Ligand
BDBM50035853
Substrate
Meas. Tech.
ChEMBL_1442755 (CHEMBL3375277)
Kd
24000±n/a nM
Citation
 Wei, ZLiu, YQZhou, XBLuo, YHuang, CQWang, YAZheng, ZBLi, S New efficient imidazolium aldoxime reactivators for nerve agent-inhibited acetylcholinesterase. Bioorg Med Chem Lett 24:5743-8 (2014)  
Target
Name:
Acetylcholinesterase
Synonyms:
ACES_HUMAN Acetylcholinesterase (AChE) | Acetylcholinesterase (human AChE)
Type:
Enzyme
Mol. Mass.:
67792.70
Organism:
Homo sapiens (Human)
Description:
P22303
Residue:
614
  
Inhibitor
Name:
BDBM50035853
Synonyms:
CHEMBL3360486
Type:
Small organic molecule
Emp. Form.:
C26H32N4O3
Mol. Mass.:
448.5573
SMILES:
COc1cc2CCN(CCCCCn3ccnc3\C=N\O)C(c3ccccc3)c2cc1OC
: