Target
Transient receptor potential cation channel subfamily M member 8
Ligand
BDBM50036542
Substrate
Meas. Tech.
ChEMBL_1432887 (CHEMBL3383300)
IC50
0.960000±n/a nM
Citation
 Ohmi, MShishido, YInoue, TAndo, KFujiuchi, AYamada, AWatanabe, SKawamura, K Identification of a novel 2-pyridyl-benzensulfonamide derivative, RQ-00203078, as a selective and orally active TRPM8 antagonist. Bioorg Med Chem Lett 24:5364-8 (2014)  
Target
Name:
Transient receptor potential cation channel subfamily M member 8
Synonyms:
LTRPC6 TRPM8_HUMAN Transient receptor potential M8 protein (TRPM8) Transient receptor potential cation channel subfamily M member 8 (TRPM8)
Type:
Enzyme
Mol. Mass.:
127693.26
Organism:
Homo sapiens (Human)
Description:
Q7Z2W7
Residue:
1104
  
Inhibitor
Name:
BDBM50036542
Synonyms:
CHEMBL3353600
Type:
Small organic molecule
Emp. Form.:
C24H22ClF3N2O4S
Mol. Mass.:
526.956
SMILES:
CC(C)(C)c1ccc(CN(c2ncc(cc2Cl)C(F)(F)F)S(=O)(=O)c2ccc(cc2)C(O)=O)cc1
: