Target
Transient receptor potential cation channel subfamily A member 1
Ligand
BDBM50036944
Substrate
Meas. Tech.
ChEMBL_1435155 (CHEMBL3389506)
IC50
38±n/a nM
Citation
 Ortar, GSchiano Moriello, AMorera, ENalli, MDi Marzo, VDe Petrocellis, L Effect of acyclic monoterpene alcohols and their derivatives on TRP channels. Bioorg Med Chem Lett 24:5507-11 (2015)  
Target
Name:
Transient receptor potential cation channel subfamily A member 1
Synonyms:
Anktm1 Trpa1
Type:
PROTEIN
Mol. Mass.:
128622.74
Organism:
Rattus norvegicus
Description:
ChEMBL_1450487
Residue:
1125
  
Inhibitor
Name:
BDBM50036944
Synonyms:
CHEMBL3355287
Type:
Small organic molecule
Emp. Form.:
C21H31NO2
Mol. Mass.:
329.4763
SMILES:
[#6]\[#6](-[#6])=[#6]\[#6]-[#6]\[#6](-[#6])=[#6]\[#6]-[#7]-[#6](=O)-[#8]-c1ccc(cc1)C([#6])([#6])[#6]
: